{"text_format":"1","workbook":"xlsx","n_sheets":5,"sheets":["Instructions","Input Guidance","Input and output","Income statement","Feed Cost per Ton Calculation"],"not_rendered":{"charts":0,"images":11,"macros":1,"external_links":0,"defined_names":7,"comments":3,"pivot_tables":0},"unopened":[],"bounds":{"document_bytes":16777216,"sheet_cells":100000,"rows_first":2000,"rows_last":500,"rows_between":2000,"halvings":0,"cell_chars":16384,"cell_head_chars":4096},"cells_cut":0,"cells_raw":0,"read":"whole","date_system":"1900"}

{"sheet":"Instructions","index":0,"n_rows":52,"n_cols":3,"rows_kept":52,"cut":false,"hidden":false,"merged":[[41,0,41,9],[29,0,30,9],[38,0,39,9],[13,0,13,9],[14,2,14,9],[22,0,22,9],[25,0,25,9],[33,0,37,9],[6,0,6,9],[7,0,7,9],[8,0,8,9],[9,0,9,9],[10,2,10,9],[11,0,11,9],[12,0,12,1],[12,2,12,9],[16,0,16,9],[19,0,19,9],[5,0,5,9],[0,0,0,9],[1,0,1,9],[3,0,3,9],[4,0,4,9],[2,0,2,9]]}
["Instructions"]
["North Dakota Economic Analysis Tool"]
["Open Lot vs Confinement Barn "]
[1]
["2023-10-12"]
["Introduction:"]
["This workbook is used for the economic comparison between open lots with a runoff pond and confinement bedded pack or slatted floor roof structures. The values used in the spreadsheet are a reference values as a starting point and data gathered from the site and producer shall be considered in the spreadsheet by the Engineer"]
["A knowledge of ag waste design and NRCS-ND Conservation Practice Standards for ag waste systems is needed to properly use this workbook."]
["Worksheet Format:"]
[]
["White","Grey"," White cells with black lettering and Grey cells are locked and can not be changed by user."]
[]
["Blue",null," Blue cells with blue lettering are user inputs. "]
[]
["Red","Triangles"," Cells with Red Triangles in the upper right corner have comments or help with data entry."]
[]
["Input Guidance:"]
["Various research information to uses as guidance when filling in the Input and output tab."]
[]
["Input and output:"]
["Fill in applicable Blue cells to the project.  If a line item does not apply it can be left blank."]
[]
["Income Statement:"]
["Provides a summary of the data."]
[]
["Feed Cost per Ton Calculation:"]
["Optional.  Used to calculate the ration cost / ton of DM."]
[]
["Instructions for data input:"]
["The Blue cells are user inputs for entering known values.  Most are self explanatory, and many have comments (red triangles) and dropdown boxes included."]
{"$rows_left_out":23}
{"sheet":"Input Guidance","index":1,"n_rows":103,"n_cols":1,"rows_kept":103,"cut":false,"hidden":false,"merged":[[0,0,2,12],[3,0,5,12]]}
["Input Guidance "]
[]
[]
["The information provided was found in various research documents as noted.   These values are to be used as guiance for filling in the Input and Output tab when information isn't available from the producer.  "]
[]
[]
["Depreciation or years of life"]
[]
[]
[]
[]
[]
[]
[]
[]
[]
["https://aglease101.org/wp-content/uploads/2020/10/NCFMEC-04.pdf"]
[]
[]
["Performance"]
["Table 4. Performance assumptions of yearling steers and steer calves fed in differing facility types1"]
[]
[]
[]
[]
[]
[]
[]
[]
[]
{"$rows_left_out":74}
{"sheet":"Input and output","index":2,"n_rows":179,"n_cols":25,"rows_kept":179,"cut":false,"hidden":false,"merged":[[0,4,2,10],[0,16,2,21],[4,4,4,5],[5,4,5,5],[6,4,6,5],[4,8,4,12],[4,17,4,21],[4,14,4,16],[45,15,45,21],[41,15,41,21],[22,15,22,16],[34,15,34,16],[35,15,35,16],[5,14,5,16],[6,14,6,16],[7,15,7,16],[9,15,9,16],[8,15,8,21],[8,6,8,7],[31,6,31,7],[32,6,32,7],[24,2,24,3],[20,2,20,3],[17,2,17,3],[11,2,11,3],[12,2,12,3],[13,2,13,3],[39,4,39,7],[32,15,32,21],[30,6,30,7],[17,15,17,16],[18,15,18,16],[20,15,20,16],[19,15,19,16],[15,15,15,16],[16,15,16,16],[21,15,21,16],[33,15,33,16],[14,15,14,21],[22,6,22,7],[17,6,17,7],[16,6,16,7],[23,6,23,7],[69,4,69,7],[68,4,68,7],[67,4,67,7],[58,4,58,7],[59,4,59,7],[60,4,60,7],[64,4,64,7],[72,4,72,7],[74,4,74,7],[73,4,73,7],[62,4,62,7],[63,4,63,7],[60,15,60,16],[46,15,46,16],[47,15,47,16],[48,15,48,16],[49,15,49,16],[62,15,62,21],[66,15,66,21],[74,15,74,21],[68,15,68,16],[67,15,67,16],[51,15,51,16],[55,15,55,16],[53,15,53,21],[69,15,69,16],[70,15,70,16],[71,15,71,16],[72,15,72,16],[7,6,7,7],[36,15,36,16],[42,15,42,16],[43,15,43,16],[44,15,44,16],[50,15,50,16],[54,15,54,16],[58,15,58,16],[59,15,59,16],[10,15,10,16],[54,4,54,7],[75,15,75,16],[76,15,76,16],[64,15,64,16],[63,15,63,16],[36,0,78,2],[4,1,4,3],[6,1,6,3],[5,1,5,3],[4,6,4,7],[5,6,5,7],[6,6,6,7],[76,4,76,7],[19,6,19,7],[16,0,17,0],[19,0,20,0],[20,6,20,7],[9,6,9,7],[10,6,10,7],[11,6,11,7],[61,4,61,7],[21,6,21,7],[75,4,75,7],[71,4,71,7],[14,2,14,3],[10,2,10,4],[56,5,56,7],[12,6,12,7],[15,6,15,7],[77,4,77,7],[78,4,78,7],[14,6,14,7],[52,4,52,7],[55,4,55,7],[42,4,42,7],[43,4,43,7],[44,4,44,7],[45,4,45,7],[46,4,46,7],[33,6,33,7],[26,6,26,7],[27,6,27,7],[48,4,48,7],[49,4,49,7],[51,4,51,7],[47,4,47,7],[53,4,53,7],[50,4,50,7]]}
[null,null,null,null,"NATURAL RESOURCES CONSERVATION SERVICE                                                             OPEN LOT VS CONFINEMENT BARN ECONOMIC ANALYSIS TOOL",null,null,null,null,null,null,null,"North Dakota",null,null,null,"             NATURAL RESOURCES CONSERVATION SERVICE                                                     OPEN LOT VS CONFINEMENT BARN ECONOMIC ANALYSIS TOOL",null,null,null,null,null,"North Dakota"]
[null,null,null,null,null,null,null,null,null,null,null,null,"2023-10-12",null,null,null,null,null,null,null,null,null,{"$f":"M2","v":"2023-10-12"}]
[null,null,null,null,null,null,null,null,null,null,null,null,"Version 1.0",null,null,null,null,null,null,null,null,null,{"$f":"M3","v":"Version 1.0"}]
[null,null,null,null,null,null,null,null,null,null,null,null,"Page 1 of 3",null,null,null,null,null,null,null,null,null,"Page 2 of 3"]
["Producer:",null,null,null,"Field Office:",null,null,null,"FACILITY DESCRIPTION ",null,null,null,null,"Producer:",{"$f":"IF(Producer=\"\",\"\",Producer)","v":""},null,null,"FACILITY DESCRIPTION "]
["Legal Desc:",null,null,null,"Details:",null,null,null,"Open lot",null,"Confinement",null,"Confinement","Legal Desc:",{"$f":"IF(Legal=\"\",\"\",Legal)","v":""},null,null,"Open lot",null,"Confinement",null,"Confinement"]
["Completed by:",null,null,null,"Date:",null,null,null,"Runoff Pond",null,"Bedded",null,"Slatted","Field Office:",{"$f":"IF(FO=\"\",\"\",FO)","v":""},null,null,"Runoff Pond",null,"Bedded",null,"Slatted"]
[null,null,null,null,null,null,"Number of head",null,600,null,600,null,600,null,null,"Number of head",null,{"$f":"I8","v":600},null,{"$f":"K8","v":600},null,{"$f":"M8","v":600}]
[null,null,null,null,null,null,"Investment for facility",null,null,null,null,null,null,null,null,"Investment for facility"]
[null,null,null,null,null,null,"Construction Cost",null,360000,null,900000,null,975000,null,null,"Total Construction Cost $",null,{"$f":"I10","v":360000},null,{"$f":"K10","v":900000},null,{"$f":"M10","v":975000}]
["Animal Type",null,"Beef",null,null,null,"Construction Cost per head",null,{"$f":"IF(I8<=0,\"0\",I10/I8)","v":600},null,{"$f":"IF(K8<=0,\"0\",K10/K8)","v":1500},null,1625,null,null,"Estimated Tax & Insurance Annual $",null,{"$f":"I12","v":0},null,{"$f":"K12","v":0},null,0]
["Animal Weight",null,500,null,null,null,"Insurance  (per year)",null,0,null,0,null,0]
["Animal Cost $/lb.",null,2.44,null,null,null,"Land area required for facility (acres)",null,3,null,0.97,null,0.76]
["Finished Weight",null,1350]
["Finished Value $/lb.",null,2.35,null,null,null,"Financing for facility",null,null,null,null,null,null,null,null,"Annual facility charges"]
[null,null,null,null,null,null,"% Borrowed direct from lender",null,0,null,0,null,0,null,null,"Principal payment per year",null,{"$f":"IF(I17<=0,\"$0.00\",PPMT(I18,1,I17,-(I8*I11-(I8*I20*I21))*I16)+PPMT(I24,1,I23,-(I8*I11-(I8*I20*I21))*I22))","v":0},null,{"$f":"IF(K17<=0,\"$0.00\",PPMT(K18,1,K17,-(K8*K11-(K8*K20*K21))*K16)+PPMT(K24,1,K23,-(K8*K11-(K8*K20*K21))*K22))","v":0},null,0,null,null,"Payment on principal for a given time *(interest rate, 1, note length (years), -(No of head x initial investment per head x % cost share)) x %borrowed direct from lender + payment on princ (interest rate % for loan, 1, note length years, - (no of head x initial investment per head -(no of head x % of  investment cost share x % cost share)) x % of investment on low interest loan"]
["Ration Cost             ($/ ton DM)",null,null,null,null,null,"Note Length (years)",null,20,null,20,null,20,null,null,"Interest payment per year",null,{"$f":"IF(I17<=0,\"$0.00\",ISPMT(I18,1,I17,-((I8*I11)-(I8*I20*I21))*I16)+ISPMT(I24,1,I23,-((I8*I11)-(I8*I20*I21))*I22))","v":0},null,{"$f":"IF(K17<=0,\"$0.00\",ISPMT(K18,1,K17,-((K8*K11)-(K8*K20*K21))*K16)+ISPMT(K24,1,K23,-((K8*K11)-(K8*K20*K21))*K22))","v":0},null,0,null,null,"ISPMT - calculates the interest paid during a given period of an investment where principal payments are equal (interest rate, 1, note length, - (((no of head investment per head)-(no of headx % of invest cost shared x %cost share)) x %borrowed direct from lender ) + IPMT ( interest rate, 1, note length, - ((no of head x initial invest per head)-(no of head x % investment cost shared x % cost shared) x % of investment on low interest loan) "]
[null,null,189,null,null,null,"Interest Rate (%)",null,8.5000000000000006E-2,null,8.5000000000000006E-2,null,8.5000000000000006E-2,null,null,"Owner equity needed",null,{"$f":"(I8*I11)*(1-I16-(I20*I21)-I22)","v":360000},null,{"$f":"(K8*K11)*(1-K16-(K20*K21)-K22)","v":900000},null,{"$f":"(M8*M11)*(1-M16-(M20*M21)-M22)","v":975000},null,null,"( no of head x initial investment per head) x (1- % borrowed direct from lender - (% of investment financially assisted x % of financial assistance) - note length years for low interest loan"]
[null,null,null,null,null,null,"Additional financial assistance or low interest loans",null,null,null,null,null,null,null,null,"Opportunity cost of owner equity",null,{"$f":"IF(I17<=0,\"$0.00\",ISPMT(I18,1,I17,-R18))","v":29070},null,{"$f":"IF(K17<=0,\"$0.00\",ISPMT(K18,1,K17,-T18))","v":72675},null,78731.25,null,null,"ISPMT - calculates the interest paid during one year of an investment where principal payments are equal ( interest rate, 1 note length years, -owner equity needed)"]
["Bedding Cost       ($/ ton)",null,null,null,null,null,"% of Construction financially assistanced",null,0,null,0,null,0,null,null,"Depreciation per year",null,{"$f":"IF(I27<=0,\"$0.00\",((I8*I11)-(I8*I11*I28))/I27)","v":18000},null,{"$f":"IF(K27<=0,\"$0.00\",((K8*K11)-(K8*K11*K28))/K27)","v":45000},null,48750,null,null,"(( no of head x initial investment per head ) - (no of head x initial investment per head x salvage value of facility % of original cost)) / depreciable years of life"]
[null,null,23,null,null,null,"% Financial Assistance",null,0,null,0,null,0,null,null,"Principal and interest payment per head",null,{"$f":" (R16+R17)/( I8*I75)","v":0},null,{"$f":"(T16+T17)/(K8*K75)","v":0},null,{"$f":"(V16+V17)/(M8*M75)","v":0},null,null,"(principal payment per year + interest payment per year) / ( no of head x turns over the year)"]
[null,null,null,null,null,null,"% of investment on low interest loan",null,0,null,0,null,0,null,null,"Annual/hd depreciation, opportunity cost, and interest ",null,{"$f":"(R17+R19+R20)/(I8*I75)","v":52.048940405104794},null,{"$f":"(T17+T19+T20)/(K8*K75)","v":127.93542074363992},null,{"$f":"(V17+V19+V20)/(M8*M75)","v":138.20956416928138},null,null,"(interest rate payment per year + opportunity cost of owner equity +depreciation per year)/(no of head x turns over the year)"]
[null,null,null,null,null,null,"Note Length (years) for low interest loan",null,30,null,30,null,30,null,null,"Annual land rental charge for facility",null,{"$f":"I13*I56","v":0},null,{"$f":"K13*K56","v":0},null,{"$f":"M13*M56","v":0},null,null,"land area required for facility x rental rate per acre for land for facility"]
["Labor",null,null,null,null,null,"Interest Rate (%) for low interest loan",null,4.4999999999999998E-2,null,4.4999999999999998E-2,null,4.4999999999999998E-2]
["Charge ($/hour)",null,23]
[null,null,null,null,null,null,"Depreciation or years of life "]
[null,null,"% of Nutrient Available for Crop",null,null,null,"Depreciable years of life ",null,20,null,20,null,20,null,null,null,null,null,null," ",null," "]
["Nutrients","$/lb. Nutrient","Open Lot","Bedded","Slatted",null,"Salvage value of facility % of original cost",null,0,null,0,null,0]
[" N",0.64,0.5,0.5,0.5]
[" P2O5",0.71,1,1,1,null,"Performance and Health"]
{"$rows_left_out":150}
{"sheet":"Income statement","index":3,"n_rows":42,"n_cols":12,"rows_kept":42,"cut":false,"hidden":false,"merged":[[40,1,40,2],[41,1,41,2],[33,1,33,2],[35,1,35,2],[37,1,37,2],[38,1,38,2],[39,1,39,2],[31,1,31,2],[20,1,20,2],[22,1,22,2],[12,1,12,2],[13,1,13,2],[14,1,14,2],[15,1,15,2],[19,1,19,2],[27,1,27,2],[25,1,25,2],[28,1,28,2],[29,1,29,2],[30,1,30,2],[23,1,23,2],[24,1,24,2],[1,2,2,7],[8,1,8,7],[10,1,11,2],[21,1,21,2],[4,1,4,4],[5,1,5,3],[6,1,6,3]]}
[null,null,null,null,null,null,null,null,"North Dakota"]
[null,null,"NATURAL RESOURCES CONSERVATION SERVICE                                                              OPEN LOT VS CONFINEMENT BARN ECONOMIC ANALYSIS TOOL",null,null,null,null,null,{"$f":"'Input and output'!M2","v":"2023-10-12"}]
[null,null,null,null,null,null,null,null,{"$f":"'Input and output'!M3","v":"Version 1.0"}]
[null,null,null,null,null,null,null,null,"Page 3 of 3"]
["Producer:",{"$f":"IF(Producer=\"\",\"\",Producer)","v":""}]
["Legal Desc:",{"$f":"IF(Legal=\"\",\"\",Legal)","v":""}]
["Field Office:",{"$f":"IF(FO=\"\",\"\",FO)","v":""}]
[]
[null,"Annual Income Statement"]
[]
[null,"Gross Income",null,{"$f":"'Input and output'!I6","v":"Open lot"},null,{"$f":"'Input and output'!K6","v":"Confinement"},null,{"$f":"'Input and output'!M6","v":"Confinement"}]
[null,null,null,{"$f":"'Input and output'!I7","v":"Runoff Pond"},null,{"$f":"'Input and output'!K7","v":"Bedded"},null,{"$f":"'Input and output'!M7","v":"Slatted"}]
[null,"Gross Beef Income",null,{"$f":"(('Input and output'!$C14*'Input and output'!$C15)*('Input and output'!I8*'Input and output'!I75))-IF('Input and output'!I79>0,('Input and output'!I79*((('Input and output'!$C14*'Input and output'!$C15)*('Input and output'!I8*'Input and output'!I75))-('Input and output'!$C14*'Input and output'!$C15)*(('Input and output'!I8)*'Input and output'!I75))),0)","v":2869022.3823529407},null,{"$f":"(('Input and output'!$C14*'Input and output'!$C15)*('Input and output'!K8*'Input and output'!K75))-IF('Input and output'!K79>0,('Input and output'!K79*((('Input and output'!$C14*'Input and output'!$C15)*('Input and output'!K8*'Input and output'!K75))-('Input and output'!$C14*'Input and output'!$C15)*(('Input and output'!K8)*'Input and output'!K75))),0)","v":2918065.5},null,{"$f":"(('Input and output'!$C14*'Input and output'!$C15)*('Input and output'!M8*'Input and output'!M75))-IF('Input and output'!M79>0,('Input and output'!M79*((('Input and output'!$C14*'Input and output'!$C15)*('Input and output'!M8*'Input and output'!M75))-('Input and output'!$C14*'Input and output'!$C15)*(('Input and output'!M8)*'Input and output'!M75))),0)","v":2926239.3529411769}]
[null,"Custom Feeding Income",null,{"$f":"('Input and output'!I77*'Input and output'!I79*'Input and output'!I8*'Input and output'!I74)+(('Input and output'!I34/2000*'Input and output'!I8*'Input and output'!I74)*'Input and output'!I78*'Input and output'!I79)","v":0},null,{"$f":"('Input and output'!K77*'Input and output'!K79*'Input and output'!K8*'Input and output'!K74)+(('Input and output'!K34/2000*'Input and output'!K8*'Input and output'!K74)*'Input and output'!K78*'Input and output'!K79)","v":0},null,{"$f":"('Input and output'!M77*'Input and output'!M79*'Input and output'!M8*'Input and output'!M74)+(('Input and output'!M34/2000*'Input and output'!M8*'Input and output'!M74)*'Input and output'!M78*'Input and output'!M79)","v":0}]
[null,"Manure Value (one year period)",null,{"$f":"'Input and output'!R35","v":40554},null,{"$f":"'Input and output'!T35","v":59610},null,{"$f":"'Input and output'!V35","v":43515}]
[null,"Total Gross Income (one year period)",null,{"$f":"D13+D14+D15","v":2909576.3823529407},null,{"$f":"F13+F14+F15","v":2977675.5},null,2969754.3529411769]
[]
[]
[null,"Annual Costs"]
[null,"Facility Interest and opportunity cost",null,{"$f":"'Input and output'!R17+'Input and output'!R19","v":29070},null,{"$f":"'Input and output'!T17+'Input and output'!T19","v":72675},null,{"$f":"'Input and output'!V17+'Input and output'!V19","v":78731.25}]
[null,"Facility Depreciation",null,{"$f":"'Input and output'!R20","v":18000},null,{"$f":"'Input and output'!T20","v":45000},null,{"$f":"'Input and output'!V20","v":48750}]
[null,"Facility Maintenance",null,{"$f":"'Input and output'!I49+'Input and output'!I50","v":0},null,{"$f":"'Input and output'!K49+'Input and output'!K50","v":0},null,{"$f":"'Input and output'!M49+'Input and output'!M50","v":0}]
[null,"Cattle Purchases",null,{"$f":"(('Input and output'!$C12*'Input and output'!$C13)*('Input and output'!I8*'Input and output'!I75))-(IF('Input and output'!I79>0,'Input and output'!I79*'Input and output'!$C12*'Input and output'!$C13*'Input and output'!I8*'Input and output'!I75,0))","v":1103296.2352941176},null,{"$f":"(('Input and output'!$C12*'Input and output'!$C13)*('Input and output'!K8*'Input and output'!K75))-(IF('Input and output'!K79>0,'Input and output'!K79*'Input and output'!$C12*'Input and output'!$C13*'Input and output'!K8*'Input and output'!K75,0))","v":1122156},null,{"$f":"(('Input and output'!$C12*'Input and output'!$C13)*('Input and output'!M8*'Input and output'!M75))-(IF('Input and output'!M79>0,'Input and output'!M79*'Input and output'!$C12*'Input and output'!$C13*'Input and output'!M8*'Input and output'!M75,0))","v":1125299.2941176472}]
[null,{"$f":"\"Feed Cost \"","v":"Feed Cost "},null,{"$f":"(('Input and output'!$C18/2000*('Input and output'!I8*'Input and output'!I74))-IF('Input and output'!I79>0,('Input and output'!I79*('Input and output'!$C18/2000*('Input and output'!I8*'Input and output'!I74))),0))","v":20695.5},null,{"$f":"(('Input and output'!$C18/2000*('Input and output'!K8*'Input and output'!K74))-IF('Input and output'!K79>0,('Input and output'!K79*('Input and output'!$C18/2000*('Input and output'!K8*'Input and output'!K74))),0))","v":20695.5},null,{"$f":"(('Input and output'!$C18/2000*('Input and output'!M8*'Input and output'!M74))-IF('Input and output'!M79>0,('Input and output'!M79*('Input and output'!$C18/2000*('Input and output'!M8*'Input and output'!M74))),0))","v":20695.5}]
[null,{"$f":"\"Labor Cost \"","v":"Labor Cost "},null,{"$f":"'Input and output'!R50","v":346.66411764705884},null,{"$f":"'Input and output'!T50","v":27456.447142857145},null,{"$f":"'Input and output'!V50","v":27649.320504201682}]
[null,{"$f":"\"Bedding Cost  \"","v":"Bedding Cost  "},null,{"$f":"'Input and output'!R44","v":25185},null,{"$f":"'Input and output'!T44","v":12592.5},null,{"$f":"'Input and output'!V44","v":0}]
[null,"Vet med",null,0,null,0,null,0]
[null,"Equipment Costs care/bedding",null,{"$f":"'Input and output'!R52","v":346.66411764705884},null,{"$f":"'Input and output'!T52","v":27456.447142857145},null,{"$f":"'Input and output'!V52","v":27649.320504201682}]
[null,"Cattle and Feed interest",null,{"$f":"'Input and output'!R55+'Input and output'!R56-(IF('Input and output'!I79>0,('Input and output'!I79*('Input and output'!R55+'Input and output'!R56)),0))","v":0},null,{"$f":"'Input and output'!T55+'Input and output'!T56-(IF('Input and output'!K79>0,('Input and output'!K79*('Input and output'!T55+'Input and output'!T56)),0))","v":26432.90625},null,{"$f":"'Input and output'!V55+'Input and output'!V56-(IF('Input and output'!M79>0,('Input and output'!M79*('Input and output'!V55+'Input and output'!V56)),0))","v":26432.906249999996},null,null,null,"Orignal forumals were the following, removed trucking costs for custom feeding and "]
[null,"Other variable costs",null,{"$f":"'Input and output'!R51-IF('Input and output'!I79>0,('Input and output'!I79*(('Input and output'!I8*'Input and output'!I75))),0)","v":0},null,{"$f":"(('Input and output'!K52)*('Input and output'!K8*'Input and output'!K75))+'Input and output'!T51-IF('Input and output'!K79>0,('Input and output'!K79*(('Input and output'!K8*'Input and output'!K75))),0)","v":0},null,{"$f":"(('Input and output'!M52)*('Input and output'!M8*'Input and output'!M75))+'Input and output'!V51-IF('Input and output'!M79>0,('Input and output'!M79*(('Input and output'!M8*'Input and output'!M75))),0)","v":0},null,null,null,"((equipment operation  + trucking charges ) + animal number x turns per year)) + custom manure application cost -IF % of capacity cutom fed >0 then % capacity of custome fed x trucking charges x no of head x number of turns"]
{"$rows_left_out":13}
{"sheet":"Feed Cost per Ton Calculation","index":4,"n_rows":45,"n_cols":11,"rows_kept":45,"cut":false,"hidden":false,"merged":[[28,1,29,1],[28,2,29,2],[28,3,29,3],[28,4,29,4],[28,5,29,5],[9,1,10,1],[9,2,10,2],[9,3,10,3],[9,4,10,4],[9,5,10,5],[1,4,2,9],[4,2,4,5],[5,2,5,5],[6,2,6,5],[28,8,29,8],[28,9,29,9],[9,7,10,7],[9,8,10,8],[9,9,10,9],[28,6,29,6],[28,7,29,7],[9,6,10,6]]}
[null,null,null,null,null,null,null,null,null,null,{"$f":"'Input and output'!M1","v":"North Dakota"}]
[null,null,null,null,"NATURAL RESOURCES CONSERVATION SERVICE                                                              OPEN LOT VS CONFINEMENT BARN ECONOMIC ANALYSIS TOOL",null,null,null,null,null,{"$f":"'Input and output'!M2","v":"2023-10-12"}]
[null,null,null,null,null,null,null,null,null,null,{"$f":"'Input and output'!M3","v":"Version 1.0"}]
[]
[null,null,{"$f":"IF(TRUE, \"\",'Input and output'!C5)","v":""}]
[null,"Producer:",{"$f":"IF(Producer=\"\",\"\",Producer)","v":""}]
[null,"Legal Desc:",{"$f":"IF(Legal=\"\",\"\",Legal)","v":""}]
[null,"Field Office:",{"$f":"IF(FO=\"\",\"\",FO)","v":""}]
[null,"Percent of Ration on Dry Matter (DM) basis"]
[null,"Feedstuff","Lbs. / unit","Cost/unit","DM % of feedstuff","% of ration on DM basis","% of ration on as fed","lbs DM","lbs as fed"]
[]
[null,"Corn",56,5.3,0.85,0.57999999999999996,{"$f":"I12/I$22","v":0.47977941176470584},{"$f":"100*F12","v":57.999999999999993},{"$f":"H12/E12","v":68.235294117647058},{"$f":"I12*(D12/C12)","v":6.4579831932773102}]
[null,"Distillers",1500,200,0.5,0.3,{"$f":"I13/I$22","v":0.421875},{"$f":"100*F13","v":30},{"$f":"H13/E13","v":60},{"$f":"I13*(D13/C13)","v":8}]
[null,"Hay ",2000,100,0.85,0.1,8.2720588235294115E-2,{"$f":"100*F14","v":10},{"$f":"H14/E14","v":11.764705882352942},{"$f":"I14*(D14/C14)","v":0.58823529411764708}]
[null,"Corn Silage",2000,40,0.4,null,0,{"$f":"100*F15","v":0},{"$f":"H15/E15","v":0},{"$f":"I15*(D15/C15)","v":0}]
[null,"Supplement",100,500,0.9,0.02,1.5625E-2,{"$f":"100*F16","v":2},{"$f":"H16/E16","v":2.2222222222222223},{"$f":"I16*(D16/C16)","v":11.111111111111111}]
[null,"Haylage",null,80,null,null,0]
[null,"Pasture",null,32,null,null,0]
[null,null,null,null,null,null,0]
[null,null,null,null,null,null,0]
[null,null,null,null,null,null,0]
[null,null,null,null,null,{"$f":"SUM(F12:F21)","v":0.99999999999999989},{"$f":"SUM(G12:G21)","v":1},{"$f":"SUM(H12:H16)","v":100},{"$f":"SUM(I12:I16)","v":142.22222222222223},{"$f":"SUM(J12:J16)","v":26.157329598506067}]
[]
[null,null,null,null,null,null,null,"Ration DM",{"$f":"H22/I22","v":0.703125}," "]
[null,null,null,null,null,null,"         Ration cost /ton of DM",null,{"$f":"J22/100*2000","v":523.14659197012134}]
[null,null,null,null,null,null,"         Ration cost/ ton as fed",null,{"$f":"J22/I22*2000","v":367.83744747899158}]
[]
[null,"Percentage of ration on As Fed basis"]
[null,"Feedstuff","Lbs. / unit","Cost/unit","DM % of feedstuff","% of ration on DM basis","% of ration on as fed","lbs DM","lbs as fed"]
[]
{"$rows_left_out":15}